3 Replies Latest reply on Feb 27, 2014 6:22 AM by Jiri Sverak

    Building production error

    Jiri Sverak

      The error is bigger than this. But always the same. Rhobuild.yml is configured correctly.

       

      RET: Checking is API level enough: 13

      RET: Checking is API level enough: 14

      RET: Checking is API level enough: 15

      RET: Checking is API level enough: 16

      RET: Checking is API level enough: 17

      RET: Checking is API level enough: 18

      RET: NDK sysroot: C:/android-ndk-r9c/platforms/android-17/arch-arm

      RET: pwd: C:/RhoMobileSuite4.0.0/ruby/lib/ruby/gems/1.9.1/gems/rhodes-4.0.

      commonAPI/coreapi

      RET: ---------------------------------------------------------------------

      -----

      RET: C:/android-ndk-r9c/toolchains/arm-linux-androideabi-4.6/prebuilt/wind

      6_64/bin/arm-linux-androideabi-g++.exe --sysroot C:/android-ndk-r9c/platfo

      droid-17/arch-arm -fPIC -Wall -Wextra -Wno-psabi -Wno-sign-compare -Wno-un

      mandroid -DANDROID -DOS_ANDROID -DRHO_DEBUG -g -O1 -fstack-protector-all -

      G -Winit-self -Wshadow -Wcast-align -Wvla -Wstack-protector -fvisibility-i

      -hidden -fno-exceptions -fno-rtti -std=c++11 -Wno-reorder -I"C:/RhoMobileS

      0.0/ruby/lib/ruby/gems/1.9.1/gems/rhodes-4.0.0/lib/commonAPI/coreapi/ext/p

      m/android/generated/jni" -I"C:/RhoMobileSuite4.0.0/ruby/lib/ruby/gems/1.9.

      /rhodes-4.0.0/lib/commonAPI/coreapi/ext/platform/android/../../shared" -I"

      MobileSuite4.0.0/ruby/lib/ruby/gems/1.9.1/gems/rhodes-4.0.0/platform/andro

      des/jni/include" -I"C:/RhoMobileSuite4.0.0/ruby/lib/ruby/gems/1.9.1/gems/r

      4.0.0/platform/android/Rhodes/jni/include/rhodes/details" -I"C:/RhoMobileS

      0.0/ruby/lib/ruby/gems/1.9.1/gems/rhodes-4.0.0/platform/shared/ruby/includ

      C:/RhoMobileSuite4.0.0/ruby/lib/ruby/gems/1.9.1/gems/rhodes-4.0.0/platform

      d" -I"C:/RhoMobileSuite4.0.0/ruby/lib/ruby/gems/1.9.1/gems/rhodes-4.0.0/pl

      /shared/common" -I"C:/RhoMobileSuite4.0.0/ruby/lib/ruby/gems/1.9.1/gems/rh

      .0.0/platform/shared/api_generator" -I"C:/Users/Jirka/workspace/Rhomobile/

      box/bin/tmp/include" -I"C:/android-ndk-r9c/sources/cxx-stl/stlport/stlport

      :/RhoMobileSuite4.0.0/ruby/lib/ruby/gems/1.9.1/gems/rhodes-4.0.0/platform/

      /ruby" -I"C:/RhoMobileSuite4.0.0/ruby/lib/ruby/gems/1.9.1/gems/rhodes-4.0.

      form/shared/ruby/android" -I"C:/RhoMobileSuite4.0.0/ruby/lib/ruby/gems/1.9

      s/rhodes-4.0.0/platform/shared/ruby/generated" -c "ext/shared/generated/sy

      pi_init.cpp" -o "C:/Users/Jirka/workspace/Rhomobile/smoneybox/bin/tmp/core

      stem_api_init.cpp.o"

      RET: ---------------------------------------------------------------------

      -----

      RET: C:/android-ndk-r9c/toolchains/arm-linux-androideabi-4.6/prebuilt/wind

      6_64/bin/arm-linux-androideabi-g++.exe --sysroot C:/android-ndk-r9c/platfo

      droid-17/arch-arm -fPIC -Wall -Wextra -Wno-psabi -Wno-sign-compare -Wno-un

      mandroid -DANDROID -DOS_ANDROID -DRHO_DEBUG -g -O1 -fstack-protector-all -

      G -Winit-self -Wshadow -Wcast-align -Wvla -Wstack-protector -fvisibility-i

      -hidden -fno-exceptions -fno-rtti -std=c++11 -Wno-reorder -I"C:/RhoMobileS

      0.0/ruby/lib/ruby/gems/1.9.1/gems/rhodes-4.0.0/lib/commonAPI/coreapi/ext/p

      m/android/generated/jni" -I"C:/RhoMobileSuite4.0.0/ruby/lib/ruby/gems/1.9.

      /rhodes-4.0.0/lib/commonAPI/coreapi/ext/platform/android/../../shared" -I"

      MobileSuite4.0.0/ruby/lib/ruby/gems/1.9.1/gems/rhodes-4.0.0/platform/andro

      des/jni/include" -I"C:/RhoMobileSuite4.0.0/ruby/lib/ruby/gems/1.9.1/gems/r

      4.0.0/platform/android/Rhodes/jni/include/rhodes/details" -I"C:/RhoMobileS

      0.0/ruby/lib/ruby/gems/1.9.1/gems/rhodes-4.0.0/platform/shared/ruby/includ

      C:/RhoMobileSuite4.0.0/ruby/lib/ruby/gems/1.9.1/gems/rhodes-4.0.0/platform

      d" -I"C:/RhoMobileSuite4.0.0/ruby/lib/ruby/gems/1.9.1/gems/rhodes-4.0.0/pl

      /shared/common" -I"C:/RhoMobileSuite4.0.0/ruby/lib/ruby/gems/1.9.1/gems/rh

      .0.0/platform/shared/api_generator" -I"C:/Users/Jirka/workspace/Rhomobile/

      box/bin/tmp/include" -I"C:/android-ndk-r9c/sources/cxx-stl/stlport/stlport

      :/RhoMobileSuite4.0.0/ruby/lib/ruby/gems/1.9.1/gems/rhodes-4.0.0/platform/

      /ruby" -I"C:/RhoMobileSuite4.0.0/ruby/lib/ruby/gems/1.9.1/gems/rhodes-4.0.

      form/shared/ruby/android" -I"C:/RhoMobileSuite4.0.0/ruby/lib/ruby/gems/1.9

      s/rhodes-4.0.0/platform/shared/ruby/generated" -c "ext/shared/generated/sy

      s_api.cpp" -o "C:/Users/Jirka/workspace/Rhomobile/smoneybox/bin/tmp/coreap

      em_js_api.cpp.o"

      RET: ---------------------------------------------------------------------

      -----

      RET: C:/android-ndk-r9c/toolchains/arm-linux-androideabi-4.6/prebuilt/wind

      6_64/bin/arm-linux-androideabi-gcc.exe --sysroot C:/android-ndk-r9c/platfo

      droid-17/arch-arm -fPIC -Wall -Wextra -Wno-psabi -Wno-sign-compare -Wno-un

      mandroid -DANDROID -DOS_ANDROID -DRHO_DEBUG -g -O1 -fstack-protector-all -

      G -Winit-self -Wshadow -Wcast-align -Wvla -Wstack-protector -I"C:/RhoMobil

      4.0.0/ruby/lib/ruby/gems/1.9.1/gems/rhodes-4.0.0/lib/commonAPI/coreapi/ext

      orm/android/generated/jni" -I"C:/RhoMobileSuite4.0.0/ruby/lib/ruby/gems/1.

      ms/rhodes-4.0.0/lib/commonAPI/coreapi/ext/platform/android/../../shared" -

      hoMobileSuite4.0.0/ruby/lib/ruby/gems/1.9.1/gems/rhodes-4.0.0/platform/and

      hodes/jni/include" -I"C:/RhoMobileSuite4.0.0/ruby/lib/ruby/gems/1.9.1/gems

      s-4.0.0/platform/android/Rhodes/jni/include/rhodes/details" -I"C:/RhoMobil

      4.0.0/ruby/lib/ruby/gems/1.9.1/gems/rhodes-4.0.0/platform/shared/ruby/incl

      I"C:/RhoMobileSuite4.0.0/ruby/lib/ruby/gems/1.9.1/gems/rhodes-4.0.0/platfo

      red" -I"C:/RhoMobileSuite4.0.0/ruby/lib/ruby/gems/1.9.1/gems/rhodes-4.0.0/

      rm/shared/common" -I"C:/RhoMobileSuite4.0.0/ruby/lib/ruby/gems/1.9.1/gems/

      -4.0.0/platform/shared/api_generator" -I"C:/Users/Jirka/workspace/Rhomobil

      eybox/bin/tmp/include" -I"C:/android-ndk-r9c/sources/cxx-stl/stlport/stlpo

      "C:/RhoMobileSuite4.0.0/ruby/lib/ruby/gems/1.9.1/gems/rhodes-4.0.0/platfor

      ed/ruby" -I"C:/RhoMobileSuite4.0.0/ruby/lib/ruby/gems/1.9.1/gems/rhodes-4.

      atform/shared/ruby/android" -I"C:/RhoMobileSuite4.0.0/ruby/lib/ruby/gems/1

      ems/rhodes-4.0.0/platform/shared/ruby/generated" -c "ext/shared/generated/

      _ruby_api.c" -o "C:/Users/Jirka/workspace/Rhomobile/smoneybox/bin/tmp/core

      stem_ruby_api.c.o"

      arm-linux-androideabi-g++.exe: error: ext/shared/generated/cpp/System_js_w

      p: No such file or directoryRET: -----------------------------------------

      ---------------------------------

       

       

      RET: C:/android-ndk-r9c/toolchains/arm-linux-androideabi-4.6/prebuilt/wind

      6_64/bin/arm-linux-androideabi-g++.exe --sysroot C:/android-ndk-r9c/platfo

      droid-17/arch-arm -fPIC -Wall -Wextra -Wno-psabi -Wno-sign-compare -Wno-un

      mandroid -DANDROID -DOS_ANDROID -DRHO_DEBUG -g -O1 -fstack-protector-all -

      G -Winit-self -Wshadow -Wcast-align -Wvla -Wstack-protector -fvisibility-i

      -hidden -fno-exceptions -fno-rtti -std=c++11 -Wno-reorder -I"C:/RhoMobileS

      0.0/ruby/lib/ruby/gems/1.9.1/gems/rhodes-4.0.0/lib/commonAPI/coreapi/ext/p

      m/android/generated/jni" -I"C:/RhoMobileSuite4.0.0/ruby/lib/ruby/gems/1.9.

      /rhodes-4.0.0/lib/commonAPI/coreapi/ext/platform/android/../../shared" -I"

      MobileSuite4.0.0/ruby/lib/ruby/gems/1.9.1/gems/rhodes-4.0.0/platform/andro

      des/jni/include" -I"C:/RhoMobileSuite4.0.0/ruby/lib/ruby/gems/1.9.1/gems/r

      4.0.0/platform/android/Rhodes/jni/include/rhodes/details" -I"C:/RhoMobileS

      0.0/ruby/lib/ruby/gems/1.9.1/gems/rhodes-4.0.0/platform/shared/ruby/includ

      C:/RhoMobileSuite4.0.0/ruby/lib/ruby/gems/1.9.1/gems/rhodes-4.0.0/platform

      d" -I"C:/RhoMobileSuite4.0.0/ruby/lib/ruby/gems/1.9.1/gems/rhodes-4.0.0/pl

      /shared/common" -I"C:/RhoMobileSuite4.0.0/ruby/lib/ruby/gems/1.9.1/gems/rh

      .0.0/platform/shared/api_generator" -I"C:/Users/Jirka/workspace/Rhomobile/

      box/bin/tmp/include" -I"C:/android-ndk-r9c/sources/cxx-stl/stlport/stlport

      :/RhoMobileSuite4.0.0/ruby/lib/ruby/gems/1.9.1/gems/rhodes-4.0.0/platform/

      /ruby" -I"C:/RhoMobileSuite4.0.0/ruby/lib/ruby/gems/1.9.1/gems/rhodes-4.0.

      form/shared/ruby/android" -I"C:/RhoMobileSuite4.0.0/ruby/lib/ruby/gems/1.9

      s/rhodes-4.0.0/platform/shared/ruby/generated" -c "ext/shared/generated/cp

      em_js_wrap.cpp" -o "C:/Users/Jirka/workspace/Rhomobile/smoneybox/bin/tmp/c

      /System_js_wrap.cpp.o"

      arm-linux-androideabi-g++.exe: fatal error: no input filesarm-linux-androi

      g++.exe: error: ext/shared/generated/system_js_api.cpp: No such file or di

      y

       

       

      cRET: --------------------------------------------------------------------

      ------

      oRET: C:/android-ndk-r9c/toolchains/arm-linux-androideabi-4.6/prebuilt/win

      86_64/bin/arm-linux-androideabi-g++.exe --sysroot C:/android-ndk-r9c/platf

      ndroid-17/arch-arm -fPIC -Wall -Wextra -Wno-psabi -Wno-sign-compare -Wno-u

      -mandroid -DANDROID -DOS_ANDROID -DRHO_DEBUG -g -O1 -fstack-protector-all

      UG -Winit-self -Wshadow -Wcast-align -Wvla -Wstack-protector -fvisibility-

      s-hidden -fno-exceptions -fno-rtti -std=c++11 -Wno-reorder -I"C:/RhoMobile

      .0.0/ruby/lib/ruby/gems/1.9.1/gems/rhodes-4.0.0/lib/commonAPI/coreapi/ext/

      rm/android/generated/jni" -I"C:/RhoMobileSuite4.0.0/ruby/lib/ruby/gems/1.9

      s/rhodes-4.0.0/lib/commonAPI/coreapi/ext/platform/android/../../shared" -I

      oMobileSuite4.0.0/ruby/lib/ruby/gems/1.9.1/gems/rhodes-4.0.0/platform/andr

      odes/jni/include" -I"C:/RhoMobileSuite4.0.0/ruby/lib/ruby/gems/1.9.1/gems/

      -4.0.0/platform/android/Rhodes/jni/include/rhodes/details" -I"C:/RhoMobile

      .0.0/ruby/lib/ruby/gems/1.9.1/gems/rhodes-4.0.0/platform/shared/ruby/inclu

      "C:/RhoMobileSuite4.0.0/ruby/lib/ruby/gems/1.9.1/gems/rhodes-4.0.0/platfor

      ed" -I"C:/RhoMobileSuite4.0.0/ruby/lib/ruby/gems/1.9.1/gems/rhodes-4.0.0/p

      m/shared/common" -I"C:/RhoMobileSuite4.0.0/ruby/lib/ruby/gems/1.9.1/gems/r

      4.0.0/platform/shared/api_generator" -I"C:/Users/Jirka/workspace/Rhomobile

      ybox/bin/tmp/include" -I"C:/android-ndk-r9c/sources/cxx-stl/stlport/stlpor

      C:/RhoMobileSuite4.0.0/ruby/lib/ruby/gems/1.9.1/gems/rhodes-4.0.0/platform

      d/ruby" -I"C:/RhoMobileSuite4.0.0/ruby/lib/ruby/gems/1.9.1/gems/rhodes-4.0

      tform/shared/ruby/android" -I"C:/RhoMobileSuite4.0.0/ruby/lib/ruby/gems/1.

      ms/rhodes-4.0.0/platform/shared/ruby/generated" -c "ext/shared/generated/c

      tem_ruby_wrap.cpp" -o "C:/Users/Jirka/workspace/Rhomobile/smoneybox/bin/tm

      api/System_ruby_wrap.cpp.o"

      arm-linux-androideabi-g++.exe: fatal error: no input filesmpila

      compilation terminated.

      tarm-linux-androideabi-gcc.exe: error: ext/shared/generated/system_ruby_ap

      o such file or directory

      iarm-linux-androideabi-gcc.exe: fatal error: no input files

      coomnp itlaetrmioin ntarm-linux-androideabi-g++.exe: error: ext/shared/gen

      /system_api_init.cpp: No such file or directoryarm-linux-androideabi-g++.e

      ror: ext/shared/generated/cpp/System_ruby_wrap.cpp: No such file or direct

       

       

      tremidn.a

      ted.

      arm-linux-androideabi-g++.exe: fatal error: no input filesarm-linux-androi

      g++.exe: fatal error: no input files

       

       

      cocmpoilampilattioino nt etremrimniantaetde.d

      .

      rake aborted!

      Compile is failed

      C:/RhoMobileSuite4.0.0/ruby/lib/ruby/gems/1.9.1/gems/rhodes-4.0.0/lib/comm

      coreapi/ext/platform/android/Rakefile:48:in `block in <top (required)>'

      C:/RhoMobileSuite4.0.0/ruby/lib/ruby/gems/1.9.1/gems/rake-10.0.4/lib/rake/

      b:246:in `call'

      C:/RhoMobileSuite4.0.0/ruby/lib/ruby/gems/1.9.1/gems/rake-10.0.4/lib/rake/

      b:246:in `block in execute'

      C:/RhoMobileSuite4.0.0/ruby/lib/ruby/gems/1.9.1/gems/rake-10.0.4/lib/rake/

      b:241:in `each'

      C:/RhoMobileSuite4.0.0/ruby/lib/ruby/gems/1.9.1/gems/rake-10.0.4/lib/rake/

      b:241:in `execute'

      C:/RhoMobileSuite4.0.0/ruby/lib/ruby/gems/1.9.1/gems/rake-10.0.4/lib/rake/

      b:184:in `block in invoke_with_call_chain'

      C:/RhoMobileSuite4.0.0/ruby/lib/ruby/1.9.1/monitor.rb:211:in `mon_synchron

      C:/RhoMobileSuite4.0.0/ruby/lib/ruby/gems/1.9.1/gems/rake-10.0.4/lib/rake/

      b:177:in `invoke_with_call_chain'

      C:/RhoMobileSuite4.0.0/ruby/lib/ruby/gems/1.9.1/gems/rake-10.0.4/lib/rake/

      b:205:in `block in invoke_prerequisites'

      C:/RhoMobileSuite4.0.0/ruby/lib/ruby/gems/1.9.1/gems/rake-10.0.4/lib/rake/

      b:203:in `each'

      C:/RhoMobileSuite4.0.0/ruby/lib/ruby/gems/1.9.1/gems/rake-10.0.4/lib/rake/

      b:203:in `invoke_prerequisites'

      C:/RhoMobileSuite4.0.0/ruby/lib/ruby/gems/1.9.1/gems/rake-10.0.4/lib/rake/

      b:183:in `block in invoke_with_call_chain'

      C:/RhoMobileSuite4.0.0/ruby/lib/ruby/1.9.1/monitor.rb:211:in `mon_synchron

      C:/RhoMobileSuite4.0.0/ruby/lib/ruby/gems/1.9.1/gems/rake-10.0.4/lib/rake/

      b:177:in `invoke_with_call_chain'

      C:/RhoMobileSuite4.0.0/ruby/lib/ruby/gems/1.9.1/gems/rake-10.0.4/lib/rake/

      b:205:in `block in invoke_prerequisites'

      C:/RhoMobileSuite4.0.0/ruby/lib/ruby/gems/1.9.1/gems/rake-10.0.4/lib/rake/

      b:203:in `each'

      C:/RhoMobileSuite4.0.0/ruby/lib/ruby/gems/1.9.1/gems/rake-10.0.4/lib/rake/

      b:203:in `invoke_prerequisites'

      C:/RhoMobileSuite4.0.0/ruby/lib/ruby/gems/1.9.1/gems/rake-10.0.4/lib/rake/

      b:183:in `block in invoke_with_call_chain'

      C:/RhoMobileSuite4.0.0/ruby/lib/ruby/1.9.1/monitor.rb:211:in `mon_synchron

      C:/RhoMobileSuite4.0.0/ruby/lib/ruby/gems/1.9.1/gems/rake-10.0.4/lib/rake/

      b:177:in `invoke_with_call_chain'

      C:/RhoMobileSuite4.0.0/ruby/lib/ruby/gems/1.9.1/gems/rake-10.0.4/lib/rake/

      b:170:in `invoke'

      C:/RhoMobileSuite4.0.0/ruby/lib/ruby/gems/1.9.1/gems/rake-10.0.4/lib/rake/

      ation.rb:143:in `invoke_task'

      C:/RhoMobileSuite4.0.0/ruby/lib/ruby/gems/1.9.1/gems/rake-10.0.4/lib/rake/

      ation.rb:101:in `block (2 levels) in top_level'

      C:/RhoMobileSuite4.0.0/ruby/lib/ruby/gems/1.9.1/gems/rake-10.0.4/lib/rake/

      ation.rb:101:in `each'

      C:/RhoMobileSuite4.0.0/ruby/lib/ruby/gems/1.9.1/gems/rake-10.0.4/lib/rake/

      ation.rb:101:in `block in top_level'

      C:/RhoMobileSuite4.0.0/ruby/lib/ruby/gems/1.9.1/gems/rake-10.0.4/lib/rake/

      ation.rb:110:in `run_with_threads'

      C:/RhoMobileSuite4.0.0/ruby/lib/ruby/gems/1.9.1/gems/rake-10.0.4/lib/rake/

      ation.rb:95:in `top_level'

      C:/RhoMobileSuite4.0.0/ruby/lib/ruby/gems/1.9.1/gems/rake-10.0.4/lib/rake/

      ation.rb:73:in `block in run'

      C:/RhoMobileSuite4.0.0/ruby/lib/ruby/gems/1.9.1/gems/rake-10.0.4/lib/rake/

      ation.rb:160:in `standard_exception_handling'

      C:/RhoMobileSuite4.0.0/ruby/lib/ruby/gems/1.9.1/gems/rake-10.0.4/lib/rake/

      ation.rb:70:in `run'

      C:/RhoMobileSuite4.0.0/ruby/lib/ruby/gems/1.9.1/gems/rake-10.0.4/bin/rake:

      `<top (required)>'

      C:/RhoMobileSuite4.0.0/ruby/bin/rake:23:in `load'

      C:/RhoMobileSuite4.0.0/ruby/bin/rake:23:in `<main>'

      Tasks: TOP => default => C:/Users/Jirka/workspace/Rhomobile/smoneybox/bin/

      /android/release/extensions/coreapi/libcoreapi.a => build

      rake aborted!

      Cannot build C:/RhoMobileSuite4.0.0/ruby/lib/ruby/gems/1.9.1/gems/rhodes-4

      ib/commonAPI/coreapi/ext

       

       

      Tasks: TOP => device:android:production => package:android => build:androi

      => build:android:rhobundle => build:android:extensions

      (See full trace by running task with --trace)